NO,����,����_�J�i,�Z��,����,�ܓx,�o�x,�W��,�d�b�ԍ�,�����ԍ�,�s�撬���R�[�h,�s���{����,�s�撬����,�ЊQ���_�^��,�ЊQ���_�R����A�y�Η��y�ђn����,�ЊQ���_����,�ЊQ���_�n�k,�ЊQ���_�Ôg,�ЊQ���_��K�͂ȉΎ�,�ЊQ���_�����×�,�ЊQ���_�ΎR����,�w����Ƃ̏d��,�z����e�l��,�ΏۂƂȂ钬��E������,URL,���l
1,������ꏬ�w�Z�i�Z��j,�t�b�T�_�C�C�`�V���E�K�b�R�E�i�R�E�e�C�j,�����s�����s����1055,,35.742528,139.325616,,042-551-3542,,132187,�����s,�����s,1,1,,1,,,,,,"8,000�l�i1�������[�g��������1�l�j",,,
2,������񏬊w�Z�i�Z��j,�t�b�T�_�C�j�V���E�K�b�R�E�i�R�E�e�C�j,�����s�����s�F��623,,35.724895,139.336207,,042-551-6141,,132187,�����s,�����s,1,1,,1,,,,,,"6,000�l�i1�������[�g��������1�l�j",,,
3,������O���w�Z�i�Z��j,�t�b�T�_�C�T���V���E�K�b�R�E�i�R�E�e�C�j,�����s�����s���l162,,35.736108,139.335216,,042-551-0257,,132187,�����s,�����s,1,1,,1,,,,,,"7,000�l�i1�������[�g��������1�l�j",,,
4,������l���w�Z�i�Z��j,�t�b�T�_�C�����V���E�K�b�R�E�i�R�E�e�C�j,�����s�����s����1290,,35.745333,139.322058,,042-551-0840,,132187,�����s,�����s,1,1,,1,,,,,,"8,000�l�i1�������[�g��������1�l�j",,,
5,������܏��w�Z�i�Z��j,�t�b�T�_�C�S�V���E�K�b�R�E�i�R�E�e�C�j,�����s�����s��c��1-2-2,,35.72133,139.331763,,042-552-0256,,132187,�����s,�����s,,,,1,,,,,,"8,000�l�i1�������[�g��������1�l�j",,,
6,������Z���w�Z�i�Z��j,�t�b�T�_�C���N�V���E�K�b�R�E�i�R�E�e�C�j,�����s�����s������1-9-1,,35.74913,139.327423,,042-551-0752,,132187,�����s,�����s,1,1,,1,,,,,,"6,000�l�i1�������[�g��������1�l�j",,,
7,�����掵���w�Z�i�Z��j,�t�b�T�_�C�i�i�V���E�K�b�R�E�i�R�E�e�C�j,�����s�����s�k�c��1-1-1,,35.732332,139.327443,,042-551-9304,,132187,�����s,�����s,,,,1,,,,,,"11,000�l�i1�������[�g��������1�l�j",,,
8,������ꒆ�w�Z�i�Z��j,�t�b�T�_�C�C�`�`���E�K�b�R�E�i�R�E�e�C�j,�����s�����s�F��845,,35.73117,139.336819,,042-551-0373,,132187,�����s,�����s,1,1,,1,,,,,,"26,000�l�i1�������[�g��������1�l�j",,,
9,������񒆊w�Z�i�Z��j,�t�b�T�_�C�j�`���E�K�b�R�E�i�R�E�e�C�j,�����s�����s������1-22-1,,35.752118,139.326323,,042-551-9601,,132187,�����s,�����s,1,1,,1,,,,,,"12,000�l�i1�������[�g��������1�l�j",,,
10,������O���w�Z�i�Z��j,�t�b�T�_�C�T���`���E�K�b�R�E�i�R�E�e�C�j,�����s�����s��c��3-1-1,,35.729301,139.331616,,042-551-9302,,132187,�����s,�����s,,,,1,,,,,,"12,000�l�i1�������[�g��������1�l�j",,,
11,�s�����������w�Z�i�Z��j,�g���c�t�b�T�R�E�g�E�K�b�R�E�i�R�E�e�C�j,�����s�����s�k�c��2-11-3,,35.736772,139.322143,,042-552-5601,,132187,�����s,�����s,,1,,1,,,,,,"10,000�l�i1�������[�g��������1�l�j",,,
12,�s�������H�ƍ����w�Z�i�Z��j,�g���c�^�}�R�E�M���E�R�E�g�E�K�b�R�E�i�R�E�e�C�j,�����s�����s�F��215,,35.716247,139.338745,,042-551-3435,,132187,�����s,�����s,1,1,,1,,,,,,"7,000�l�i1�������[�g��������1�l�j",,,
13,����������,�J�~�_�C���R�E�G��,�����s�����s������1-21,,35.750741,139.327023,,042-551-1985,,132187,�����s,�����s,1,1,,1,,,,,,"10,000�l�i1�������[�g��������1�l�j",,,
14,������������,���N�Z�C�R�E�G��,�����s�����s����2148-1,,35.743456,139.335713,,042-551-1985,,132187,�����s,�����s,1,1,,1,,,,,,"2,000�l�i1�������[�g��������1�l�j",,,
15,��������,�����c�P�R�E�G��,�����s�����s����2151-12,,35.743456,139.335713,,042-551-1985,,132187,�����s,�����s,1,1,,1,,,,,,"3,000�l�i1�������[�g��������1�l�j",,,
16,��������,�t�b�T�R�E�G��,�����s�����s���l163,,35.734378,139.33685,,042-551-1985,,132187,�����s,�����s,1,1,,1,,,,,,"35,000�l�i1�������[�g��������1�l�j",,,
17,��������,�t�N�g�E�R�E�G��,�����s�����s�F��1620,,35.723369,139.349478,,042-551-1985,,132187,�����s,�����s,1,1,,1,,,,,,"23,000�l�i1�������[�g��������1�l�j",,,
18,���_������,�~���E�W���V�^�R�E�G��,�����s�����s��c��1-12-1,,35.723783,139.330592,,042-551-1985,,132187,�����s,�����s,,1,,1,,,,,,"7,000�l�i1�������[�g��������1�l�j",,,
19,�r����,���c�~�R�E�G��,�����s�����s�F��422-1,,35.720313,139.338651,,042-551-1985,,132187,�����s,�����s,1,1,,1,,,,,,"1,000�l�i1�������[�g��������1�l�j",,,
20,�������,�E�V�C�`�R�E�G��,�����s�����s���l59-2,,35.735074,139.331139,,042-551-1985,,132187,�����s,�����s,1,1,,1,,,,,,"1,000�l�i1�������[�g��������1�l�j",,,
21,�Ђӂ݌���,�q�t�~�R�E�G��,�����s�����s�{��25-4,,35.739387,139.329562,,042-551-1985,,132187,�����s,�����s,1,1,,1,,,,,,"1,000�l�i1�������[�g��������1�l�j",,,
22,�����J�ˎ�������,�n���K���g�W�h�E���E�G��,�����s�����s����2250-11,,35.741359,139.334968,,042-551-1985,,132187,�����s,�����s,1,1,,1,,,,,,"2,000�l�i1�������[�g��������1�l�j",,,
23,�t�����h�V�b�v�p�[�N,�t�����h�V�b�v�p�[�N,�����s�����s����2351-11,,35.739239,139.338268,,042-551-1985,,132187,�����s,�����s,1,1,,1,,,,,,"1,000�l�i1�������[�g��������1�l�j",,,
24,�F������,�N�}�E�V�R�E�G��,�����s�����s�F��929-5,,35.732259,139.335119,,042-551-1985,,132187,�����s,�����s,1,1,,1,,,,,,"2,000�l�i1�������[�g��������1�l�j",,,
25,������䓌����,���T�V�m�_�C�q�K�V�R�E�G��,�����s�����s�������1-14,,35.747192,139.332912,,042-551-1985,,132187,�����s,�����s,1,1,,1,,,,,,"3,000�l�i1�������[�g��������1�l�j",,,
26,�������N�싅��,�t�N�g�E�V���E�l�����L���E�W���E,�����s�����s�F��1608,,35.722839,139.350375,,042-551-1985,,132187,�����s,�����s,1,1,,1,,,,,,"11,000�l�i1�������[�g��������1�l�j",,,
27,���h�~���j�A���p�[�N,�t�N�G�C�~���j�A���p�[�N,�����s�����s�F��1143-1,,35.730813,139.340765,,042-551-1985,,132187,�����s,�����s,1,1,,1,,,,,,"2,000�l�i1�������[�g��������1�l�j",,,
28,�����g���_�`����,�t�N�g�E�g���_�`�R�E�G��,�����s�����s�F��1573-1,,35.725395,139.351704,,042-551-1985,,132187,�����s,�����s,1,1,,1,,,,,,"12,000�l�i1�������[�g��������1�l�j",,,
29,�ʐ�㐅�Βn����������,�^�}�K���W���E�X�C�����N�`�j�b�R�E�o�V�R�E�G��,�����s�����s�F��1386-1,,35.725249,139.341466,,042-551-1985,,132187,�����s,�����s,1,1,,1,,,,,,"13,000�l�i1�������[�g��������1�l�j",,,
30,�݂����炢�ǌ���,�~�Y�N���C�h�R�E�G��,�����s�����s�F��1359-1,,35.727045,139.339865,,042-551-1985,,132187,�����s,�����s,1,1,,1,,,,,,"7,000�l�i1�������[�g��������1�l�j",,,
31,������Βn���������,�^�}�K�������N�`�t�b�T�~�i�~�R�E�G��,�����s�����s��c��1-1-1,,35.716677,139.331301,,042-551-1985,,132187,�����s,�����s,,,,1,,1,,,,"61,000�l�i1�������[�g��������1�l�j",,,
32,������Βn�������R����,�^�}�K�������N�`�t�b�T���i�M���}�R�E�G��,�����s�����s�k�c��2-8-2,,35.739168,139.319417,,042-551-1985,,132187,�����s,�����s,,1,,1,,1,,,,"19,000�l�i1�������[�g��������1�l�j",,,
33,������Βn�������ɍ����,�^�}�K�������N�`�t�b�T�J�j�T�J�R�E�G��,�����s�����s����1185-15,,35.744408,139.318124,,042-551-1985,,132187,�����s,�����s,,,,1,,1,,,,"14,000�l�i1�������[�g��������1�l�j",,,
34,�����쒆������,�^�}�K���`���E�I�E�R�E�G��,�����s�����s�k�c��1��,,35.730607,139.326276,,042-551-1985,,132187,�����s,�����s,,1,,1,,1,,,,"65,000�l�i1�������[�g��������1�l�j",,,
